android – error: Unable to load contents of file checklist: ‘/Goal Help Information. npx react-native run-ios

[ad_1]

I’ve upgraded mac to macOS Ventura V13

XCode Model 14.0.1

Till right this moment all the things labored completely on my mac for React Native, it had been days since I began something new

Right this moment I wished to start out a brand new mission and I received some errors.

It has been a number of days searching for an answer to this downside and naturally I am not giving up, however I believe attempting issues randomly will solely mess up my configuration much more

Are you able to assist me with this ?

Would it not be smart to take away all my React Native Improvement setup and setting and begin over?

I’ve began like this:

npx react-native init MyProject

And I’ve obtained this within the terminal:

   ✔ Downloading template
    ✔ Copying template
    ✔ Processing template
    ✖ Putting in Bundler
    error Your Ruby model is 2.6.10, however your Gemfile specified 2.7.5
    
    ✖ Putting in Bundler
    error Error: Seems to be like your iOS setting just isn't correctly set. 
Please go to https://reactnative.dev/docs/subsequent/environment-setup and observe the React Native CLI QuickStart information for macOS and iOS.

When I’ve run “npx react-native run-ios” I obtain the next error that forestalls my Utility from being compiled:

data Discovered Xcode mission "MyAwesomeM1.xcodeproj"
data Constructing (utilizing "xcodebuild -project MyAwesomeM1.xcodeproj -configuration Debug -scheme MyAwesomeM1 -destination id=")
error Didn't construct iOS mission. We ran "xcodebuild" command nevertheless it exited with error code 65. To debug construct logs additional, think about constructing your app with Xcode.app, by opening MyAwesomeM1.xcodeproj.
Command line invocation:
    /Functions/Xcode.app/Contents/Developer/usr/bin/xcodebuild -project MyAwesomeM1.xcodeproj -configuration Debug -scheme MyAwesomeM1 -destination id=39519BD6-BF77-4086-B896-646C9FAD2237

Consumer defaults from command line:
    IDEPackageSupportUseBuiltinSCM = YES

Put together packages

Computing goal dependency graph and provisioning inputs

Create construct description
Construct description signature: 
Construct description path: /Customers/miguelito/Library/Developer/Xcode/DerivedData/MyAwesomeM1-cwtqpqolrtesoxdzxrobotfpeptc/Construct/Intermediates.noindex/XCBuildData/ca50488282d13a3e2ccad0b05c9c8440-desc.xcbuild

notice: Constructing targets in dependency order
/Customers/miguelito/MyAwesomeM1/ios/Pods/Goal Help Information/Pods-MyAwesomeM1/Pods-MyAwesomeM1.debug.xcconfig:1:1: error: unable to open configuration settings file
/Customers/miguelito/MyAwesomeM1/ios/Pods/Goal Help Information/Pods-MyAwesomeM1/Pods-MyAwesomeM1.debug.xcconfig:1:1: error: unable to open configuration settings file
/Customers/miguelito/MyAwesomeM1/ios/Pods/Goal Help Information/Pods-MyAwesomeM1/Pods-MyAwesomeM1.debug.xcconfig:1:1: error: unable to open configuration settings file
/Customers/miguelito/MyAwesomeM1/ios/Pods/Goal Help Information/Pods-MyAwesomeM1/Pods-MyAwesomeM1.debug.xcconfig:1:1: error: unable to open configuration settings file
warning: Unable to learn contents of XCFileList '/Goal Help Information/Pods-MyAwesomeM1/Pods-MyAwesomeM1-resources-Debug-output-files.xcfilelist' (in goal 'MyAwesomeM1' from mission 'MyAwesomeM1')
warning: Unable to learn contents of XCFileList '/Goal Help Information/Pods-MyAwesomeM1/Pods-MyAwesomeM1-frameworks-Debug-output-files.xcfilelist' (in goal 'MyAwesomeM1' from mission 'MyAwesomeM1')
error: Unable to load contents of file checklist: '/Goal Help Information/Pods-MyAwesomeM1/Pods-MyAwesomeM1-resources-Debug-input-files.xcfilelist' (in goal 'MyAwesomeM1' from mission 'MyAwesomeM1')
error: Unable to load contents of file checklist: '/Goal Help Information/Pods-MyAwesomeM1/Pods-MyAwesomeM1-resources-Debug-output-files.xcfilelist' (in goal 'MyAwesomeM1' from mission 'MyAwesomeM1')
error: Unable to load contents of file checklist: '/Goal Help Information/Pods-MyAwesomeM1/Pods-MyAwesomeM1-frameworks-Debug-input-files.xcfilelist' (in goal 'MyAwesomeM1' from mission 'MyAwesomeM1')
warning: Run script construct section '[CP] Copy Pods Sources' might be run throughout each construct as a result of it doesn't specify any outputs. To deal with this warning, both add output dependencies to the script section, or configure it to run in each construct by unchecking "Based mostly on dependency evaluation" within the script section. (in goal 'MyAwesomeM1' from mission 'MyAwesomeM1')
error: Unable to load contents of file checklist: '/Goal Help Information/Pods-MyAwesomeM1/Pods-MyAwesomeM1-frameworks-Debug-output-files.xcfilelist' (in goal 'MyAwesomeM1' from mission 'MyAwesomeM1')
warning: Run script construct section 'Bundle React Native code and pictures' might be run throughout each construct as a result of it doesn't specify any outputs. To deal with this warning, both add output dependencies to the script section, or configure it to run in each construct by unchecking "Based mostly on dependency evaluation" within the script section. (in goal 'MyAwesomeM1' from mission 'MyAwesomeM1')
warning: Run script construct section 'Begin Packager' might be run throughout each construct as a result of it doesn't specify any outputs. To deal with this warning, both add output dependencies to the script section, or configure it to run in each construct by unchecking "Based mostly on dependency evaluation" within the script section. (in goal 'MyAwesomeM1' from mission 'MyAwesomeM1')
warning: Run script construct section '[CP] Embed Pods Frameworks' might be run throughout each construct as a result of it doesn't specify any outputs. To deal with this warning, both add output dependencies to the script section, or configure it to run in each construct by unchecking "Based mostly on dependency evaluation" within the script section. (in goal 'MyAwesomeM1' from mission 'MyAwesomeM1')
** BUILD FAILED **
data Run CLI with --verbose flag for extra particulars.

I’ve tried to run the applying in XCode, however I additionally get errors:

  • Unable to load contents of file checklist: ‘/Goal Help Information/Pods-MiguelFhasion/Pods-MiguelFhasion-frameworks-Debug-input-files.xcfilelist’

  • Unable to load contents of file checklist: ‘/Goal Help Information/Pods-MiguelFhasion/Pods-MiguelFhasion-frameworks-Debug-output-files.xcfilelist’

Run script construct section ‘Bundle React Native code and pictures’ might be
run throughout each construct as a result of it doesn’t specify any outputs. To
tackle this warning, both add output dependencies to the script
section, or configure it to run in each construct by unchecking “Based mostly on
dependency evaluation” within the script section.

When I attempt to run the mission for Android ( npx react-native run-android), it would not work both, I get quite a lot of errors, however once I run the mission in Android Studio, all the things works

I’ve googled, Boards, Stack for options and located stuff, made modifications to my React Native set up, set up Node once more, Brew once more, made quite a lot of modifications and now nothing works.

[ad_2]

Leave a Reply